Error Makefile Error 2

RECOMMENDED: If you have Windows errors then we strongly recommend that you download and run this (Windows) Repair Tool.

CVS commit: pkgsrc/security/gnupg2 – To: pkgsrc-changes%[email protected]; Subject: CVS commit: pkgsrc/security/gnupg2; From: "Brian Ginsbach" <ginsbach%[email protected]> Date: Wed, 30 Aug 2017 18.

(Reuters Health) – When medical errors lead to serious injuries, patients and families may feel better when doctors take the time to listen to their feelings about the mistake and explain what can be done to prevent it from happening again,

And in Game 3 of the 2017 NLDS, his defensive foibles took the spotlight.

What causes Windows errors? A Windows error is an error that happens when an unexpected condition occurs or when a desired operation has failed.

The Evil Within 2 has launched for PC and consoles with stellar reviews.

Apr 17, 2017. 5.1 Error: unresolved symbols remain; 5.2 Error: undefined symbol "ResetISR", SourceDir : Build of generated source libraries failed: exit status = 2:. We use gmake to build makefiles, and gmake doesn't deal well with.

I’m trying to use GCC (linux) with a makefile to compile my project. I get the following error which is can’t seem to decipher in this context: "No rule to make.

Preparing Preparing and Running Make. To prepare to use make, you must write a file called the makefile that describes the relationships among files in your program.

State Rep. Dan Thurlow, R-Mesa County, speaks Tuesday at the Colorado.

I get error whenever I’m trying to ‘make’ file, I did this before I typed ‘make’: tar xjf xarchiver-0.5.4.tar.bz2 cd./xarchiver-0.5.4./configure Configure command.

I’m writing a Makefile that does string matching at one place, the code is like: if test.; then shell scripts. fi ifeq ($(DIST_TYPE),nightly.

Makefile:584: recipe for target 'modules' failed make: *** [modules] Error 2. I looked inside Makefile and noticed that basically all the other.

libs/openFrameworksCompiled/project/makefileCommon/compile.project.mk:200. recipe for target 'Release' failed make: *** [Release] Error 2.

2. Getting Started. This section describes how to build and run LAMMPS, for both new and experienced users.

But Brett Gardner did just that in the third inning of the Yankees’ 2-1 loss to the.

Error Fix Software Review Jul 22, 2017. Our in-depth review reveals what the program will and won't do. So does the Reimage Windows PC

Makefile:127: recipe for target 'all' failed make: *** [all] Error 2. Any help is greatly appreciated ! Thanks a lot. I'm on Ubuntu 16.04. Last edited.

Hi, I'm trying to compile and simulate my design which is a Mixed (VHDL+Verilog) design using VCS and have come across the errors during elaboration

Jun 24, 2015. build/target/user-part/platform-6-m-lto/user-part.elf] Error 1 make[2]:. [W:/Particle /firmware-0.4.2/modules/photon/system-part1/makefile] Error 2.

Mapi Error Messages Error Messages, MAPI Controls. An unspecified error occurred during the current action. For example, the action was unable to delete
Jailbreak Error Lockdown Connection Failed Aug 4, 2017. If you encountered this problem while re-jailbreaking your home depot jailbreak or yalu, then. The lockdown:57 error

Strasburg, of course, finished fourth in all of baseball in ERA (2.52). Roark tied.

RECOMMENDED: Click here to fix Windows errors and improve system performance

This article was written by Arturo.